﻿2026-07-08T01:49:57.3888064Z ##[group]Run $ErrorActionPreference = "Stop"
2026-07-08T01:49:57.3888420Z [36;1m$ErrorActionPreference = "Stop"[0m
2026-07-08T01:49:57.3888655Z [36;1m$PIN = "0c95435"[0m
2026-07-08T01:49:57.3888897Z [36;1m$CACHE = "$env:USERPROFILE\spt-n1-oldbroker"[0m
2026-07-08T01:49:57.3889163Z [36;1m$BIN = "$CACHE\target\debug\spt.exe"[0m
2026-07-08T01:49:57.3889522Z [36;1m$built = if (Test-Path "$CACHE\.builtpin") { (Get-Content "$CACHE\.builtpin").Trim() } else { "" }[0m
2026-07-08T01:49:57.3889897Z [36;1mif (-not (Test-Path $BIN) -or $built -ne $PIN) {[0m
2026-07-08T01:49:57.3890213Z [36;1m  if (Test-Path $CACHE) { Remove-Item -Recurse -Force $CACHE }[0m
2026-07-08T01:49:57.3890496Z [36;1m  git clone $env:GITHUB_WORKSPACE $CACHE[0m
2026-07-08T01:49:57.3890738Z [36;1m  git -C $CACHE checkout $PIN[0m
2026-07-08T01:49:57.3891598Z [36;1m  cargo build --manifest-path "$CACHE\Cargo.toml" -p spt --bin spt[0m
2026-07-08T01:49:57.3891902Z [36;1m  Set-Content "$CACHE\.builtpin" $PIN[0m
2026-07-08T01:49:57.3892199Z [36;1m}[0m
2026-07-08T01:49:57.3892372Z [36;1m$env:SPT_N1_OLD_BROKER = $BIN[0m
2026-07-08T01:49:57.3892630Z [36;1mcargo test -p spt --test n1_pairing -- --nocapture[0m
2026-07-08T01:49:57.3954015Z shell: C:\Program Files\PowerShell\7\pwsh.EXE -command ". '{0}'"
2026-07-08T01:49:57.3954319Z ##[endgroup]
2026-07-08T01:49:58.4987080Z    Compiling proc-macro2 v1.0.106
2026-07-08T01:49:58.4987402Z    Compiling quote v1.0.45
2026-07-08T01:49:58.4987638Z    Compiling unicode-ident v1.0.24
2026-07-08T01:49:58.4987871Z    Compiling cfg-if v1.0.4
2026-07-08T01:49:58.4988066Z    Compiling serde_core v1.0.228
2026-07-08T01:49:58.4988337Z    Compiling serde v1.0.228
2026-07-08T01:49:58.4988757Z    Compiling windows-link v0.2.1
2026-07-08T01:49:58.4989114Z    Compiling portable-atomic v1.13.1
2026-07-08T01:49:58.4989619Z    Compiling getrandom v0.3.4
2026-07-08T01:49:58.4990010Z    Compiling typenum v1.20.1
2026-07-08T01:49:58.4990405Z    Compiling version_check v0.9.5
2026-07-08T01:49:58.4991046Z    Compiling pin-project-lite v0.2.17
2026-07-08T01:49:58.4991401Z    Compiling find-msvc-tools v0.1.9
2026-07-08T01:49:58.4991937Z    Compiling critical-section v1.2.0
2026-07-08T01:49:58.4992373Z    Compiling memchr v2.8.1
2026-07-08T01:49:58.4992830Z    Compiling shlex v2.0.1
2026-07-08T01:49:58.5699826Z    Compiling windows-sys v0.61.2
2026-07-08T01:49:58.5931623Z    Compiling subtle v2.6.1
2026-07-08T01:49:58.6356966Z    Compiling equivalent v1.0.2
2026-07-08T01:49:58.6476753Z    Compiling smallvec v1.15.1
2026-07-08T01:49:58.6814682Z    Compiling futures-core v0.3.32
2026-07-08T01:49:58.7354299Z    Compiling itoa v1.0.18
2026-07-08T01:49:58.7869465Z    Compiling bytes v1.11.1
2026-07-08T01:49:58.7940978Z    Compiling semver v1.0.28
2026-07-08T01:49:58.8375493Z    Compiling stable_deref_trait v1.2.1
2026-07-08T01:49:58.8699274Z    Compiling log v0.4.32
2026-07-08T01:49:58.8887206Z    Compiling generic-array v0.14.7
2026-07-08T01:49:58.9242027Z    Compiling slab v0.4.12
2026-07-08T01:49:58.9844768Z    Compiling rustc_version v0.4.1
2026-07-08T01:49:59.0794904Z    Compiling futures-io v0.3.32
2026-07-08T01:49:59.1156751Z    Compiling futures-sink v0.3.32
2026-07-08T01:49:59.1267056Z    Compiling rand_core v0.10.1
2026-07-08T01:49:59.1745303Z    Compiling hashbrown v0.17.1
2026-07-08T01:49:59.2782078Z    Compiling futures-task v0.3.32
2026-07-08T01:49:59.3039120Z    Compiling rustversion v1.0.22
2026-07-08T01:49:59.3074342Z    Compiling getrandom v0.2.17
2026-07-08T01:49:59.3891613Z    Compiling futures-channel v0.3.32
2026-07-08T01:49:59.4416066Z    Compiling getrandom v0.4.2
2026-07-08T01:49:59.4872940Z    Compiling cpufeatures v0.2.17
2026-07-08T01:49:59.5278454Z    Compiling fnv v1.0.7
2026-07-08T01:49:59.5328729Z    Compiling libc v0.2.186
2026-07-08T01:49:59.5463166Z    Compiling cfg_aliases v0.2.1
2026-07-08T01:49:59.8416039Z    Compiling indexmap v2.14.0
2026-07-08T01:50:00.1029694Z    Compiling strsim v0.11.1
2026-07-08T01:50:00.1885100Z    Compiling autocfg v1.5.1
2026-07-08T01:50:00.2137721Z    Compiling writeable v0.6.3
2026-07-08T01:50:00.2351528Z    Compiling litemap v0.8.2
2026-07-08T01:50:00.3294105Z    Compiling jobserver v0.1.34
2026-07-08T01:50:00.3312364Z    Compiling icu_normalizer_data v2.2.0
2026-07-08T01:50:00.3414126Z    Compiling fs_extra v1.3.0
2026-07-08T01:50:00.4182311Z    Compiling dunce v1.0.5
2026-07-08T01:50:00.5010259Z    Compiling cc v1.2.63
2026-07-08T01:50:00.5080385Z    Compiling ident_case v1.0.1
2026-07-08T01:50:00.6223154Z    Compiling utf8_iter v1.0.4
2026-07-08T01:50:00.6796732Z    Compiling icu_properties_data v2.2.0
2026-07-08T01:50:00.6878376Z    Compiling percent-encoding v2.3.2
2026-07-08T01:50:00.8770668Z    Compiling syn v2.0.117
2026-07-08T01:50:00.8798008Z    Compiling crypto-common v0.1.7
2026-07-08T01:50:00.8835299Z    Compiling http v1.4.1
2026-07-08T01:50:00.9190001Z    Compiling unicode-segmentation v1.13.3
2026-07-08T01:50:00.9779487Z    Compiling cpufeatures v0.3.0
2026-07-08T01:50:00.9873012Z    Compiling aws-lc-rs v1.17.0
2026-07-08T01:50:00.9963247Z    Compiling thiserror v2.0.18
2026-07-08T01:50:01.0072165Z    Compiling scopeguard v1.2.0
2026-07-08T01:50:01.0101093Z    Compiling form_urlencoded v1.2.2
2026-07-08T01:50:01.0803899Z    Compiling chacha20 v0.10.0
2026-07-08T01:50:01.1123519Z    Compiling lock_api v0.4.14
2026-07-08T01:50:01.1418662Z    Compiling block-buffer v0.10.4
2026-07-08T01:50:01.2290893Z    Compiling untrusted v0.9.0
2026-07-08T01:50:01.4267836Z    Compiling cmake v0.1.58
2026-07-08T01:50:01.4785996Z    Compiling bitflags v2.12.1
2026-07-08T01:50:01.4854684Z    Compiling winapi v0.3.9
2026-07-08T01:50:01.7118503Z    Compiling digest v0.10.7
2026-07-08T01:50:01.7251049Z    Compiling num-traits v0.2.19
2026-07-08T01:50:01.7298669Z    Compiling windows-strings v0.5.1
2026-07-08T01:50:01.8246248Z    Compiling rand v0.10.1
2026-07-08T01:50:01.8321270Z    Compiling windows-result v0.4.1
2026-07-08T01:50:01.8564201Z    Compiling rustls v0.23.40
2026-07-08T01:50:01.8825494Z    Compiling heck v0.5.0
2026-07-08T01:50:01.9245131Z    Compiling convert_case v0.10.0
2026-07-08T01:50:02.0283962Z    Compiling atomic-waker v1.1.2
2026-07-08T01:50:02.1115654Z    Compiling anyhow v1.0.102
2026-07-08T01:50:02.1774123Z    Compiling unicode-xid v0.2.6
2026-07-08T01:50:02.1887310Z    Compiling const-oid v0.10.2
2026-07-08T01:50:02.2305592Z    Compiling httparse v1.10.1
2026-07-08T01:50:02.2445331Z    Compiling aws-lc-sys v0.41.0
2026-07-08T01:50:02.2463315Z    Compiling ring v0.17.14
2026-07-08T01:50:02.2581344Z    Compiling parking_lot_core v0.9.12
2026-07-08T01:50:02.3678016Z    Compiling zerocopy v0.8.50
2026-07-08T01:50:02.4902916Z    Compiling http-body v1.0.1
2026-07-08T01:50:02.6594033Z    Compiling hybrid-array v0.4.12
2026-07-08T01:50:02.6645805Z    Compiling curve25519-dalek v4.1.3
2026-07-08T01:50:02.7661857Z    Compiling ahash v0.8.12
2026-07-08T01:50:02.7875408Z    Compiling base64ct v1.8.3
2026-07-08T01:50:02.9344203Z    Compiling powerfmt v0.2.0
2026-07-08T01:50:02.9719204Z    Compiling fastrand v2.4.1
2026-07-08T01:50:03.2660354Z    Compiling either v1.16.0
2026-07-08T01:50:03.3873972Z    Compiling deranged v0.5.8
2026-07-08T01:50:03.3874895Z    Compiling pem-rfc7468 v1.0.0
2026-07-08T01:50:03.4735947Z    Compiling uuid v1.23.2
2026-07-08T01:50:03.5177794Z    Compiling rand_core v0.6.4
2026-07-08T01:50:03.6288590Z    Compiling pkg-config v0.3.33
2026-07-08T01:50:03.6330529Z    Compiling num-conv v0.2.2
2026-07-08T01:50:03.7431177Z    Compiling base64 v0.22.1
2026-07-08T01:50:03.7902688Z    Compiling tower-service v0.3.3
2026-07-08T01:50:03.8211036Z    Compiling try-lock v0.2.5
2026-07-08T01:50:03.9045350Z    Compiling vcpkg v0.2.15
2026-07-08T01:50:03.9144143Z    Compiling zmij v1.0.21
2026-07-08T01:50:03.9436145Z    Compiling synstructure v0.13.2
2026-07-08T01:50:04.0002651Z    Compiling darling_core v0.20.11
2026-07-08T01:50:04.0056026Z    Compiling time-core v0.1.8
2026-07-08T01:50:04.0162001Z    Compiling data-encoding v2.11.0
2026-07-08T01:50:04.0241849Z    Compiling tinyvec_macros v0.1.1
2026-07-08T01:50:04.2626216Z    Compiling tinyvec v1.11.0
2026-07-08T01:50:04.2827500Z    Compiling want v0.3.1
2026-07-08T01:50:04.3215870Z    Compiling parking_lot v0.12.5
2026-07-08T01:50:04.3665080Z    Compiling crypto-common v0.2.2
2026-07-08T01:50:04.5172120Z    Compiling block-buffer v0.12.0
2026-07-08T01:50:04.5174363Z    Compiling sha2 v0.10.9
2026-07-08T01:50:04.6708016Z    Compiling vergen-lib v9.1.0
2026-07-08T01:50:04.6805436Z    Compiling inout v0.1.4
2026-07-08T01:50:04.6937270Z    Compiling n0-future v0.3.2
2026-07-08T01:50:04.7019950Z    Compiling winnow v1.0.3
2026-07-08T01:50:04.8338005Z    Compiling diatomic-waker v0.2.3
2026-07-08T01:50:04.8339504Z    Compiling libsqlite3-sys v0.30.1
2026-07-08T01:50:04.9605049Z    Compiling windows_x86_64_msvc v0.52.6
2026-07-08T01:50:04.9751254Z    Compiling signature v2.2.0
2026-07-08T01:50:05.0558480Z    Compiling crossbeam-utils v0.8.21
2026-07-08T01:50:05.0962490Z    Compiling spin v0.10.0
2026-07-08T01:50:05.1205774Z    Compiling serde_json v1.0.150
2026-07-08T01:50:05.2016124Z    Compiling httpdate v1.0.3
2026-07-08T01:50:05.2721625Z    Compiling cordyceps v0.3.4
2026-07-08T01:50:05.3140326Z    Compiling parking v2.2.1
2026-07-08T01:50:05.4346035Z    Compiling socket2 v0.6.4
2026-07-08T01:50:05.4348007Z    Compiling mio v1.2.1
2026-07-08T01:50:05.5406413Z    Compiling futures-buffered v0.2.13
2026-07-08T01:50:05.5437353Z    Compiling futures-lite v2.6.1
2026-07-08T01:50:05.5649821Z    Compiling digest v0.11.3
2026-07-08T01:50:05.5705767Z    Compiling ed25519 v2.2.3
2026-07-08T01:50:05.9242530Z    Compiling toml_parser v1.1.2+spec-1.1.0
2026-07-08T01:50:05.9268719Z    Compiling cipher v0.4.4
2026-07-08T01:50:05.9846835Z    Compiling vergen v9.1.0
2026-07-08T01:50:05.9984663Z    Compiling vergen-lib v0.1.6
2026-07-08T01:50:06.0656886Z    Compiling universal-hash v0.5.1
2026-07-08T01:50:06.0728689Z    Compiling noq-udp v0.10.0
2026-07-08T01:50:06.2407495Z    Compiling curve25519-dalek v5.0.0-pre.6
2026-07-08T01:50:06.2410848Z    Compiling heapless v0.7.17
2026-07-08T01:50:06.2670815Z    Compiling sync_wrapper v1.0.2
2026-07-08T01:50:06.2804235Z    Compiling allocator-api2 v0.2.21
2026-07-08T01:50:06.3220884Z    Compiling opaque-debug v0.3.1
2026-07-08T01:50:06.4157592Z    Compiling byteorder v1.5.0
2026-07-08T01:50:06.4191937Z    Compiling toml_datetime v1.1.1+spec-1.1.0
2026-07-08T01:50:06.4416802Z    Compiling serde_derive v1.0.228
2026-07-08T01:50:06.5861320Z    Compiling zeroize_derive v1.4.3
2026-07-08T01:50:06.6108837Z    Compiling zerofrom-derive v0.1.7
2026-07-08T01:50:06.6288751Z    Compiling yoke-derive v0.8.2
2026-07-08T01:50:06.6337690Z    Compiling tokio-macros v2.7.0
2026-07-08T01:50:06.6405643Z    Compiling futures-macro v0.3.32
2026-07-08T01:50:06.6507677Z    Compiling zerovec-derive v0.11.3
2026-07-08T01:50:06.6867635Z    Compiling displaydoc v0.2.6
2026-07-08T01:50:06.7472892Z    Compiling tracing-attributes v0.1.31
2026-07-08T01:50:06.7757224Z    Compiling thiserror-impl v2.0.18
2026-07-08T01:50:07.2077392Z    Compiling curve25519-dalek-derive v0.1.1
2026-07-08T01:50:07.2704341Z    Compiling zeroize v1.8.2
2026-07-08T01:50:07.5768354Z    Compiling tokio v1.52.3
2026-07-08T01:50:07.5768875Z    Compiling rustls-pki-types v1.14.1
2026-07-08T01:50:07.6602643Z    Compiling darling_macro v0.20.11
2026-07-08T01:50:07.7018441Z    Compiling derive_more-impl v2.1.1
2026-07-08T01:50:07.8815135Z    Compiling windows-interface v0.59.3
2026-07-08T01:50:07.8869244Z    Compiling futures-util v0.3.32
2026-07-08T01:50:07.9496891Z    Compiling spez v0.1.2
2026-07-08T01:50:07.9557043Z    Compiling n0-error-macros v0.1.3
2026-07-08T01:50:08.0467347Z    Compiling windows-implement v0.60.2
2026-07-08T01:50:08.1814528Z    Compiling darling v0.20.11
2026-07-08T01:50:08.2258129Z    Compiling zerofrom v0.1.8
2026-07-08T01:50:08.3372011Z    Compiling der v0.8.0-rc.10
2026-07-08T01:50:08.4172472Z    Compiling pin-project-internal v1.1.13
2026-07-08T01:50:08.4633610Z    Compiling derive_builder_core v0.20.2
2026-07-08T01:50:08.6351661Z    Compiling yoke v0.8.3
2026-07-08T01:50:08.8224845Z    Compiling windows-core v0.62.2
2026-07-08T01:50:08.9011181Z    Compiling toml_edit v0.25.12+spec-1.1.0
2026-07-08T01:50:08.9574984Z    Compiling hash32 v0.2.1
2026-07-08T01:50:09.0241209Z    Compiling zerovec v0.11.6
2026-07-08T01:50:09.0313076Z    Compiling zerotrie v0.2.4
2026-07-08T01:50:09.0663728Z    Compiling n0-error v0.1.3
2026-07-08T01:50:09.1768734Z    Compiling ed25519-dalek v2.2.0
2026-07-08T01:50:09.5167709Z    Compiling spki v0.8.0-rc.4
2026-07-08T01:50:09.5619643Z    Compiling polyval v0.6.2
2026-07-08T01:50:09.6166813Z    Compiling tinystr v0.8.3
2026-07-08T01:50:09.7211035Z    Compiling potential_utf v0.1.5
2026-07-08T01:50:09.7665640Z    Compiling derive_builder_macro v0.20.2
2026-07-08T01:50:09.7851773Z    Compiling pkcs8 v0.11.0-rc.10
2026-07-08T01:50:09.8063848Z    Compiling icu_locale_core v2.2.0
2026-07-08T01:50:09.8596230Z    Compiling icu_collections v2.2.0
2026-07-08T01:50:09.8938202Z    Compiling pin-project v1.1.13
2026-07-08T01:50:10.0358940Z    Compiling spin v0.9.8
2026-07-08T01:50:10.1332223Z    Compiling vergen-gitcl v1.0.8
2026-07-08T01:50:10.2230630Z    Compiling windows-threading v0.2.1
2026-07-08T01:50:10.2942937Z    Compiling ryu v1.0.23
2026-07-08T01:50:10.3187682Z    Compiling derive_builder v0.20.2
2026-07-08T01:50:10.4146169Z    Compiling fallible-iterator v0.3.0
2026-07-08T01:50:10.4222942Z    Compiling fallible-streaming-iterator v0.1.9
2026-07-08T01:50:10.4652880Z    Compiling signature v3.0.0
2026-07-08T01:50:10.5631146Z    Compiling tower-layer v0.3.3
2026-07-08T01:50:10.6403330Z    Compiling futures-executor v0.3.32
2026-07-08T01:50:10.6828031Z    Compiling windows-future v0.3.2
2026-07-08T01:50:10.7432107Z    Compiling icu_provider v2.2.0
2026-07-08T01:50:10.8240730Z    Compiling windows-targets v0.52.6
2026-07-08T01:50:10.8310324Z    Compiling ghash v0.5.1
2026-07-08T01:50:10.9849689Z    Compiling ipnet v2.12.0
2026-07-08T01:50:11.0027345Z    Compiling ed25519 v3.0.0-rc.4
2026-07-08T01:50:11.0427025Z    Compiling icu_properties v2.2.0
2026-07-08T01:50:11.0466312Z    Compiling icu_normalizer v2.2.0
2026-07-08T01:50:11.1923762Z    Compiling data-encoding-macro-internal v0.1.18
2026-07-08T01:50:11.2156013Z    Compiling futures v0.3.32
2026-07-08T01:50:11.3166561Z    Compiling prefix-trie v0.8.4
2026-07-08T01:50:11.3312181Z    Compiling windows-numerics v0.3.1
2026-07-08T01:50:11.5073652Z    Compiling once_cell v1.21.4
2026-07-08T01:50:11.5407036Z    Compiling windows-collections v0.3.2
2026-07-08T01:50:11.6221940Z    Compiling tokio-util v0.7.18
2026-07-08T01:50:11.6305257Z    Compiling proc-macro-crate v3.5.0
2026-07-08T01:50:11.6384109Z    Compiling spt-proto v0.29.0 (C:\actions-runner\_work\spt-core\spt-core\crates\spt-proto)
2026-07-08T01:50:11.7438426Z    Compiling tracing-core v0.1.36
2026-07-08T01:50:11.8210782Z    Compiling derive_more v2.1.1
2026-07-08T01:50:11.8471594Z    Compiling cobs v0.3.0
2026-07-08T01:50:11.8472118Z    Compiling postcard-derive v0.2.2
2026-07-08T01:50:11.9039793Z    Compiling ctr v0.9.2
2026-07-08T01:50:11.9885179Z    Compiling aes v0.8.4
2026-07-08T01:50:12.0011764Z    Compiling hashbrown v0.14.5
2026-07-08T01:50:12.0903780Z    Compiling sha2 v0.11.0-rc.5
2026-07-08T01:50:12.0922738Z    Compiling fs2 v0.4.3
2026-07-08T01:50:12.1088995Z    Compiling tracing v0.1.44
2026-07-08T01:50:12.1173276Z    Compiling time v0.3.47
2026-07-08T01:50:12.3169524Z    Compiling idna_adapter v1.2.2
2026-07-08T01:50:12.3606366Z    Compiling http-body-util v0.1.3
2026-07-08T01:50:12.4013974Z    Compiling idna v1.1.0
2026-07-08T01:50:12.4714256Z    Compiling aead v0.5.2
2026-07-08T01:50:12.5987130Z    Compiling h2 v0.4.14
2026-07-08T01:50:12.6061639Z    Compiling hashlink v0.9.1
2026-07-08T01:50:12.6461132Z    Compiling arrayvec v0.7.6
2026-07-08T01:50:12.6579994Z    Compiling widestring v1.2.1
2026-07-08T01:50:12.6612914Z    Compiling ipconfig v0.3.4
2026-07-08T01:50:12.7460827Z    Compiling url v2.5.8
2026-07-08T01:50:12.8754436Z    Compiling utf8parse v0.2.2
2026-07-08T01:50:12.9248689Z    Compiling rusqlite v0.32.1
2026-07-08T01:50:12.9586381Z    Compiling ed25519-dalek v3.0.0-pre.6
2026-07-08T01:50:13.0324334Z    Compiling aes-gcm v0.10.3
2026-07-08T01:50:13.0435655Z    Compiling postcard v1.1.3
2026-07-08T01:50:13.0750666Z    Compiling num_enum_derive v0.7.6
2026-07-08T01:50:13.1942037Z    Compiling windows v0.62.2
2026-07-08T01:50:13.2499572Z    Compiling data-encoding-macro v0.1.20
2026-07-08T01:50:13.3171550Z    Compiling hickory-proto v0.26.0-beta.4
2026-07-08T01:50:13.3486031Z    Compiling tower v0.5.3
2026-07-08T01:50:13.4779834Z    Compiling windows-sys v0.59.0
2026-07-08T01:50:13.5285873Z    Compiling chrono v0.4.45
2026-07-08T01:50:13.6234378Z    Compiling crossbeam-channel v0.5.15
2026-07-08T01:50:13.6388527Z    Compiling crossbeam-epoch v0.9.18
2026-07-08T01:50:14.0430805Z    Compiling spt-store v0.29.0 (C:\actions-runner\_work\spt-core\spt-core\crates\spt-store)
2026-07-08T01:50:14.0531000Z    Compiling async-trait v0.1.89
2026-07-08T01:50:14.2595130Z    Compiling iroh-metrics-derive v0.4.1
2026-07-08T01:50:14.2655293Z    Compiling strum_macros v0.28.0
2026-07-08T01:50:14.2737652Z    Compiling enum-assoc v1.3.0
2026-07-08T01:50:14.2887720Z    Compiling blake3 v1.8.5
2026-07-08T01:50:14.3919219Z    Compiling windows-registry v0.6.1
2026-07-08T01:50:14.6333005Z    Compiling memoffset v0.6.5
2026-07-08T01:50:14.7769941Z    Compiling noq v0.18.0
2026-07-08T01:50:14.8047995Z    Compiling netwatch v0.16.0
2026-07-08T01:50:14.8976322Z    Compiling acto v0.8.2
2026-07-08T01:50:14.9837958Z    Compiling foldhash v0.2.0
2026-07-08T01:50:15.0492847Z    Compiling sorted-index-buffer v0.2.1
2026-07-08T01:50:15.1675720Z    Compiling mac-addr v0.3.0
2026-07-08T01:50:15.2340613Z    Compiling thiserror v1.0.69
2026-07-08T01:50:15.2480069Z    Compiling lru-slab v0.1.2
2026-07-08T01:50:15.2687558Z    Compiling tagptr v0.2.0
2026-07-08T01:50:15.2888276Z    Compiling identity-hash v0.1.0
2026-07-08T01:50:15.3277262Z    Compiling ref-cast v1.0.25
2026-07-08T01:50:15.3620845Z    Compiling rustc-hash v2.1.2
2026-07-08T01:50:15.3866503Z    Compiling xml-rs v0.8.28
2026-07-08T01:50:15.4679615Z    Compiling moka v0.12.15
2026-07-08T01:50:15.4931031Z    Compiling netdev v0.42.0
2026-07-08T01:50:15.6707345Z    Compiling hashbrown v0.16.1
2026-07-08T01:50:15.7250850Z    Compiling iroh-relay v0.98.0
2026-07-08T01:50:15.7490971Z    Compiling iroh-metrics v0.38.3
2026-07-08T01:50:15.9811439Z    Compiling xmltree v0.10.3
2026-07-08T01:50:16.2051182Z    Compiling num_enum v0.7.6
2026-07-08T01:50:16.2152644Z    Compiling tower-http v0.6.11
2026-07-08T01:50:16.3308761Z    Compiling hyper v1.10.1
2026-07-08T01:50:16.3906997Z    Compiling spt-msg v0.29.0 (C:\actions-runner\_work\spt-core\spt-core\crates\spt-msg)
2026-07-08T01:50:16.4428097Z    Compiling iroh-base v0.98.0
2026-07-08T01:50:16.4541110Z    Compiling attohttpc v0.30.1
2026-07-08T01:50:16.5455223Z    Compiling n0-watcher v0.6.1
2026-07-08T01:50:16.6774283Z    Compiling strum v0.28.0
2026-07-08T01:50:16.7076769Z    Compiling tokio-stream v0.1.18
2026-07-08T01:50:16.7370379Z    Compiling toml_datetime v0.6.11
2026-07-08T01:50:17.1595509Z    Compiling serde_spanned v0.6.9
2026-07-08T01:50:17.1656581Z    Compiling thiserror-impl v1.0.69
2026-07-08T01:50:17.1794011Z    Compiling ref-cast-impl v1.0.25
2026-07-08T01:50:17.2490361Z    Compiling serde_derive_internals v0.29.1
2026-07-08T01:50:17.2867878Z    Compiling simple-dns v0.9.3
2026-07-08T01:50:17.3659607Z    Compiling serial-core v0.4.0
2026-07-08T01:50:17.4212044Z    Compiling aho-corasick v1.1.4
2026-07-08T01:50:17.4719367Z    Compiling toml_write v0.1.2
2026-07-08T01:50:17.6839159Z    Compiling hyper-util v0.1.20
2026-07-08T01:50:17.7603421Z    Compiling constant_time_eq v0.4.2
2026-07-08T01:50:17.7650841Z    Compiling smol_str v0.1.24
2026-07-08T01:50:17.9007443Z    Compiling resolv-conf v0.7.6
2026-07-08T01:50:17.9097335Z    Compiling regex-syntax v0.8.10
2026-07-08T01:50:18.0911664Z    Compiling winnow v0.7.15
2026-07-08T01:50:18.1354102Z    Compiling simdutf8 v0.1.5
2026-07-08T01:50:18.2847123Z    Compiling arrayref v0.3.9
2026-07-08T01:50:18.4347659Z    Compiling sha1_smol v1.0.1
2026-07-08T01:50:18.4861645Z    Compiling winreg v0.10.1
2026-07-08T01:50:18.5317857Z    Compiling schemars_derive v1.2.1
2026-07-08T01:50:18.6317359Z    Compiling iroh-dns v0.98.0
2026-07-08T01:50:18.9426953Z    Compiling serial-windows v0.4.0
2026-07-08T01:50:19.1161201Z    Compiling igd-next v0.17.1
2026-07-08T01:50:19.1994750Z    Compiling lru v0.16.4
2026-07-08T01:50:19.2419472Z    Compiling webpki-roots v1.0.7
2026-07-08T01:50:19.3052224Z    Compiling seize v0.5.1
2026-07-08T01:50:19.3636319Z    Compiling darling_core v0.23.0
2026-07-08T01:50:19.7634370Z    Compiling regex-automata v0.4.14
2026-07-08T01:50:19.8273503Z    Compiling toml_edit v0.22.27
2026-07-08T01:50:19.8575938Z    Compiling serde_bytes v0.11.19
2026-07-08T01:50:19.9120889Z    Compiling hmac v0.12.1
2026-07-08T01:50:20.0469724Z    Compiling iroh v0.98.2
2026-07-08T01:50:20.0470181Z    Compiling pin-utils v0.1.0
2026-07-08T01:50:20.0496133Z    Compiling bitflags v1.3.2
2026-07-08T01:50:20.0926723Z    Compiling anstyle v1.0.14
2026-07-08T01:50:20.1123577Z    Compiling cmov v0.5.4
2026-07-08T01:50:20.1584863Z    Compiling lazy_static v1.5.0
2026-07-08T01:50:20.2117073Z    Compiling dyn-clone v1.0.20
2026-07-08T01:50:20.2289411Z    Compiling once_cell_polyfill v1.70.2
2026-07-08T01:50:20.3022077Z    Compiling shared_library v0.1.9
2026-07-08T01:50:20.3923800Z    Compiling schemars v1.2.1
2026-07-08T01:50:20.3953899Z    Compiling anstyle-wincon v3.0.11
2026-07-08T01:50:20.4066399Z    Compiling ctutils v0.4.2
2026-07-08T01:50:20.4387316Z    Compiling nix v0.25.1
2026-07-08T01:50:20.4402052Z    Compiling hkdf v0.12.4
2026-07-08T01:50:20.5834398Z    Compiling papaya v0.2.4
2026-07-08T01:50:20.6114453Z    Compiling filedescriptor v0.8.3
2026-07-08T01:50:20.6333935Z    Compiling swarm-discovery v0.6.0-alpha.2
2026-07-08T01:50:20.6962829Z    Compiling serial v0.4.0
2026-07-08T01:50:20.7257987Z    Compiling anstyle-parse v1.0.0
2026-07-08T01:50:20.8034460Z    Compiling backon v1.6.0
2026-07-08T01:50:20.8358238Z    Compiling anstyle-query v1.1.5
2026-07-08T01:50:20.8942518Z    Compiling vte_generate_state_changes v0.1.2
2026-07-08T01:50:20.9550044Z    Compiling downcast-rs v1.2.1
2026-07-08T01:50:21.0214388Z    Compiling paste v1.0.15
2026-07-08T01:50:21.0730096Z    Compiling colorchoice v1.0.5
2026-07-08T01:50:21.1124753Z    Compiling foldhash v0.1.5
2026-07-08T01:50:21.1578049Z    Compiling instability v0.3.12
2026-07-08T01:50:21.2916299Z    Compiling is_terminal_polyfill v1.70.2
2026-07-08T01:50:21.2982415Z    Compiling shell-words v1.1.1
2026-07-08T01:50:21.3190209Z    Compiling vte v0.13.1
2026-07-08T01:50:21.3568341Z    Compiling anstream v1.0.0
2026-07-08T01:50:21.3889406Z    Compiling portable-pty v0.8.1
2026-07-08T01:50:21.5812264Z    Compiling hashbrown v0.15.5
2026-07-08T01:50:21.7027591Z    Compiling toml v0.8.23
2026-07-08T01:50:21.7268619Z    Compiling spake2 v0.4.0
2026-07-08T01:50:21.8426416Z    Compiling strum_macros v0.26.4
2026-07-08T01:50:22.1025118Z    Compiling regex v1.12.3
2026-07-08T01:50:22.1398635Z    Compiling terminal_size v0.4.4
2026-07-08T01:50:22.3053281Z    Compiling crossterm_winapi v0.9.1
2026-07-08T01:50:22.3294934Z    Compiling itertools v0.13.0
2026-07-08T01:50:22.3302531Z    Compiling sha1 v0.10.6
2026-07-08T01:50:22.6531654Z    Compiling spt-runtime v0.29.0 (C:\actions-runner\_work\spt-core\spt-core\crates\spt-runtime)
2026-07-08T01:50:22.7337945Z    Compiling castaway v0.2.4
2026-07-08T01:50:22.7360990Z    Compiling clap_lex v1.1.0
2026-07-08T01:50:22.7431692Z    Compiling recvmsg v1.0.0
2026-07-08T01:50:22.7795808Z    Compiling wmi v0.18.4
2026-07-08T01:50:22.9656955Z    Compiling indoc v2.0.7
2026-07-08T01:50:23.0505589Z    Compiling darling_macro v0.23.0
2026-07-08T01:50:23.1254680Z    Compiling static_assertions v1.1.0
2026-07-08T01:50:23.1759880Z    Compiling doctest-file v1.1.1
2026-07-08T01:50:23.2357490Z    Compiling unicode-width v0.1.14
2026-07-08T01:50:23.3003828Z    Compiling compact_str v0.8.2
2026-07-08T01:50:23.5635831Z    Compiling clap_builder v4.6.0
2026-07-08T01:50:23.5822076Z    Compiling darling v0.23.0
2026-07-08T01:50:23.5940124Z    Compiling crossterm v0.28.1
2026-07-08T01:50:23.9348567Z    Compiling strum v0.26.3
2026-07-08T01:50:23.9584811Z    Compiling interprocess v2.4.2
2026-07-08T01:50:24.1607065Z    Compiling unicode-truncate v1.1.0
2026-07-08T01:50:24.2204123Z    Compiling lru v0.12.5
2026-07-08T01:50:24.4071336Z    Compiling spt-term v0.29.0 (C:\actions-runner\_work\spt-core\spt-core\crates\spt-term)
2026-07-08T01:50:24.8605210Z    Compiling portmapper v0.16.0
2026-07-08T01:50:25.0926733Z    Compiling spt-live v0.29.0 (C:\actions-runner\_work\spt-core\spt-core\crates\spt-live)
2026-07-08T01:50:25.1683955Z    Compiling clap_derive v4.6.1
2026-07-08T01:50:25.2296051Z    Compiling unicode-width v0.2.0
2026-07-08T01:50:25.2443851Z    Compiling error-code v3.3.2
2026-07-08T01:50:25.2965883Z    Compiling cassowary v0.3.0
2026-07-08T01:50:25.4115267Z    Compiling clipboard-win v5.4.1
2026-07-08T01:50:25.4308750Z    Compiling nucleo-matcher v0.3.1
2026-07-08T01:50:25.4341227Z    Compiling qrcode v0.14.1
2026-07-08T01:50:25.5508700Z    Compiling tempfile v3.27.0
2026-07-08T01:50:25.9372524Z    Compiling ratatui v0.29.0
2026-07-08T01:50:27.0080183Z    Compiling clap v4.6.1
2026-07-08T01:50:39.1383639Z    Compiling rustls-webpki v0.103.13
2026-07-08T01:50:41.4831132Z    Compiling tokio-rustls v0.26.4
2026-07-08T01:50:41.4831480Z    Compiling rustls-platform-verifier v0.7.0
2026-07-08T01:50:41.4831765Z    Compiling noq-proto v0.17.0
2026-07-08T01:50:41.6340823Z    Compiling hickory-net v0.26.0-beta.4
2026-07-08T01:50:41.6341313Z    Compiling hyper-rustls v0.27.9
2026-07-08T01:50:41.6342212Z    Compiling tokio-websockets v0.13.2
2026-07-08T01:50:41.7886201Z    Compiling reqwest v0.13.4
2026-07-08T01:50:42.7536900Z    Compiling hickory-resolver v0.26.0-beta.4
2026-07-08T01:51:01.4409916Z    Compiling spt-net v0.29.0 (C:\actions-runner\_work\spt-core\spt-core\crates\spt-net)
2026-07-08T01:51:02.9215469Z    Compiling spt-daemon v0.29.0 (C:\actions-runner\_work\spt-core\spt-core\crates\spt-daemon)
2026-07-08T01:51:12.9237619Z    Compiling spt v0.29.0 (C:\actions-runner\_work\spt-core\spt-core\crates\spt)
2026-07-08T01:51:21.2401207Z     Finished `test` profile [unoptimized + debuginfo] target(s) in 1m 23s
2026-07-08T01:51:21.2667454Z      Running tests\n1_pairing.rs (target\debug\deps\n1_pairing-8be37c51cf8874e7.exe)
2026-07-08T01:51:21.3745774Z 
2026-07-08T01:51:21.3746212Z running 1 test
2026-07-08T01:51:29.9203581Z 
2026-07-08T01:51:29.9204353Z thread 'new_brain_serves_against_old_broker' (18864) panicked at crates\spt\tests\n1_pairing.rs:161:5:
2026-07-08T01:51:29.9204823Z the current brain must connect + handshake the old broker (BRAIN_UP).
2026-07-08T01:51:29.9205092Z TRACE:
2026-07-08T01:51:29.9205193Z 
2026-07-08T01:51:29.9205343Z note: run with `RUST_BACKTRACE=1` environment variable to display a backtrace
2026-07-08T01:51:29.9219921Z test new_brain_serves_against_old_broker ... FAILED
2026-07-08T01:51:29.9220226Z 
2026-07-08T01:51:29.9220292Z failures:
2026-07-08T01:51:29.9220410Z 
2026-07-08T01:51:29.9220478Z failures:
2026-07-08T01:51:29.9220650Z     new_brain_serves_against_old_broker
2026-07-08T01:51:29.9220799Z 
2026-07-08T01:51:29.9220969Z test result: FAILED. 0 passed; 1 failed; 0 ignored; 0 measured; 0 filtered out; finished in 8.55s
2026-07-08T01:51:29.9221235Z 
2026-07-08T01:51:29.9240365Z error: test failed, to rerun pass `-p spt --test n1_pairing`
2026-07-08T01:51:29.9736368Z ##[error]Process completed with exit code 1.
